{"text_format":"1","workbook":"xlsx","n_sheets":5,"sheets":["User_Stories","Use Cases","SADLS Business Capability Model","SADLS Users","DMV Staff Pos Codes"],"not_rendered":{"charts":0,"images":0,"macros":0,"external_links":3,"defined_names":5,"comments":0,"pivot_tables":0},"unopened":[],"bounds":{"document_bytes":16777216,"sheet_cells":100000,"rows_first":2000,"rows_last":500,"rows_between":2000,"halvings":0,"cell_chars":16384,"cell_head_chars":4096},"cells_cut":0,"cells_raw":0,"read":"whole","date_system":"1900"}

{"sheet":"User_Stories","index":0,"n_rows":787,"n_cols":10,"rows_kept":787,"cut":false,"hidden":false,"merged":[]}
["NEW User Story ID","COMMENTS","AS A <type of user>","I WANT TO <perform some task>","SO THAT I CAN <achieve some goal>","Level 1 BCM","Level 2 BCM ","Level 3 BCM ","BCM Level 1-2-3","Capability Model Definition"]
[1," ","Examiner - Any","Set up a new customer record","Record data regarding customer contact information to associate all of a customer's  DMV transactions - Process A","Manage Customer Records","Create New Record","Capture Contact Information",{"$f":"TRIM(CONCATENATE(F2,\"-\",G2,\"-\",H2))","v":"Manage Customer Records-Create New Record-Capture Contact Information"},{"$f":"VLOOKUP(I2,'SADLS Business Capability Model'!$E$1:$F$299,2,FALSE)","v":"To create a new record DMV must collect standard contact information regarding the contact such as primary/secondary address, phone, email.  "}]
[{"$f":"A2+1","v":2},null,"Adjudication Officer","Set up a new customer record","Record data regarding customer contact information to associate all of a customer's  DMV transactions - Process B","Manage Customer Records","Create New Record","Capture Contact Information",{"$f":"TRIM(CONCATENATE(F3,\"-\",G3,\"-\",H3))","v":"Manage Customer Records-Create New Record-Capture Contact Information"},{"$f":"VLOOKUP(I3,'SADLS Business Capability Model'!$E$1:$F$299,2,FALSE)","v":"To create a new record DMV must collect standard contact information regarding the contact such as primary/secondary address, phone, email.  "}]
[{"$f":"A3+1","v":3},null,"Examiner - Any","Collect customer's personal information ","Record information regarding a customer's personal characteristics such as height, hair color, weight, etc. so DMV can distinguish individual customers.","Manage Customer Records","Create New Record","Capture Personal Information ",{"$f":"TRIM(CONCATENATE(F4,\"-\",G4,\"-\",H4))","v":"Manage Customer Records-Create New Record-Capture Personal Information"},{"$f":"VLOOKUP(I4,'SADLS Business Capability Model'!$E$1:$F$299,2,FALSE)","v":"To create a new record DMV must collect personal information regarding the contact such as height, hair color, etc. "}]
[4,null,"Examiner - Any","Validate customer information","Confirm the authenticity, accuracy and completeness of customer record information provided by the customer or external sources.","Manage Customer Records","Validate Customer Information","Confirm Accuracy of Customer Information ","Manage Customer Records-Validate Customer Information-Confirm Accuracy of Customer Information",{"$f":"VLOOKUP(I5,'SADLS Business Capability Model'!$E$1:$F$299,2,FALSE)","v":"Confirm that the information entered into the system (regardless of who it was entered by) was typed accurately and meets DMV entry standards "}]
[5,null,"Central Issuance Verification","Record Legal Presence documentation submitted to the Examiner to verify legal presence ","Verify the information using the SAVE interface","Manage Customer Records","Validate Customer Information","Confirm Accuracy of Customer Information ","Manage Customer Records-Validate Customer Information-Confirm Accuracy of Customer Information",{"$f":"VLOOKUP(I6,'SADLS Business Capability Model'!$E$1:$F$299,2,FALSE)","v":"Confirm that the information entered into the system (regardless of who it was entered by) was typed accurately and meets DMV entry standards "}]
[6,null,"Traffic Records","Add any missing information and update crash reports ","Provide correct crash report information ","Manage Customer Records","Validate Customer Information","Confirm Accuracy of Customer Information ","Manage Customer Records-Validate Customer Information-Confirm Accuracy of Customer Information",{"$f":"VLOOKUP(I7,'SADLS Business Capability Model'!$E$1:$F$299,2,FALSE)","v":"Confirm that the information entered into the system (regardless of who it was entered by) was typed accurately and meets DMV entry standards "}]
[7,null,"Central Issuance Verification","Verify the documentation given to the Examiner for legal presence via interface with SAVE","Either Print the approval and renew the TDC/TIC or disapprove the issuance ","Manage Customer Records","Validate Customer Information","Confirm Accuracy of Customer Information ","Manage Customer Records-Validate Customer Information-Confirm Accuracy of Customer Information",{"$f":"VLOOKUP(I8,'SADLS Business Capability Model'!$E$1:$F$299,2,FALSE)","v":"Confirm that the information entered into the system (regardless of who it was entered by) was typed accurately and meets DMV entry standards "}]
[8,null,"Examiner - Any","Review customer documentation","Verify the customer information was entered correctly ","Manage Customer Records","Validate Customer Information","Review Documentation for Authenticity ","Manage Customer Records-Validate Customer Information-Review Documentation for Authenticity",{"$f":"VLOOKUP(I9,'SADLS Business Capability Model'!$E$1:$F$299,2,FALSE)","v":"Review Documentation to verify that Customer information into the system was entered properly and accurately. "}]
[9,null,"System","Conduct quality assurance check of customer records","Ensure customer addresses are entered correctly","Manage Customer Records","Validate Customer Information","Conduct External Checks ","Manage Customer Records-Validate Customer Information-Conduct External Checks",{"$f":"VLOOKUP(I10,'SADLS Business Capability Model'!$E$1:$F$299,2,FALSE)","v":"Conduct any automated checks available to ensure information is entered correctly and accurately (e.g., Address validation, SSN, Validation of Lawful Status,  and formatted properly) "}]
[10,null,"System","Conduct quality assurance check of customer records","Ensure customer SSNs are entered correctly","Manage Customer Records","Validate Customer Information","Conduct External Checks ","Manage Customer Records-Validate Customer Information-Conduct External Checks",{"$f":"VLOOKUP(I11,'SADLS Business Capability Model'!$E$1:$F$299,2,FALSE)","v":"Conduct any automated checks available to ensure information is entered correctly and accurately (e.g., Address validation, SSN, Validation of Lawful Status,  and formatted properly) "}]
[11,null,"System","Conduct quality assurance check of customer records","Ensure customer validation of lawful status","Manage Customer Records","Validate Customer Information","Conduct External Checks ","Manage Customer Records-Validate Customer Information-Conduct External Checks",{"$f":"VLOOKUP(I12,'SADLS Business Capability Model'!$E$1:$F$299,2,FALSE)","v":"Conduct any automated checks available to ensure information is entered correctly and accurately (e.g., Address validation, SSN, Validation of Lawful Status,  and formatted properly) "}]
[12,null,"System","Conduct quality assurance check of customer records","Ensure customer information is entered correctly and formatted properly.","Manage Customer Records","Validate Customer Information","Conduct External Checks ","Manage Customer Records-Validate Customer Information-Conduct External Checks",{"$f":"VLOOKUP(I13,'SADLS Business Capability Model'!$E$1:$F$299,2,FALSE)","v":"Conduct any automated checks available to ensure information is entered correctly and accurately (e.g., Address validation, SSN, Validation of Lawful Status,  and formatted properly) "}]
[13,null,"Examiner - Any","Initiate a customer merge request","Flag/Identify records that should be placed on the merge report and researched further","Manage Customer Records","Manage Duplicate Records","Identify Duplicate Record","Manage Customer Records-Manage Duplicate Records-Identify Duplicate Record",{"$f":"VLOOKUP(I14,'SADLS Business Capability Model'!$E$1:$F$299,2,FALSE)","v":"Run standard reports using name, address, birthdate and other identifying information in the system to find and eliminate a duplicate record "}]
[14,null,"System","Generate Merge Report","Generate a list of records that an adjudication officer should evaluate for potentially merging","Manage Customer Records","Manage Duplicate Records","Identify Duplicate Record","Manage Customer Records-Manage Duplicate Records-Identify Duplicate Record",{"$f":"VLOOKUP(I15,'SADLS Business Capability Model'!$E$1:$F$299,2,FALSE)","v":"Run standard reports using name, address, birthdate and other identifying information in the system to find and eliminate a duplicate record "}]
[15,null,"Adjudication Officer","Review the merge report that was generated for me ","Identify source and target records prior to merging records","Manage Customer Records","Manage Duplicate Records","Identify Target Record","Manage Customer Records-Manage Duplicate Records-Identify Target Record",{"$f":"VLOOKUP(I16,'SADLS Business Capability Model'!$E$1:$F$299,2,FALSE)","v":"Run standard search or process  to find target record where information should be consolidated "}]
[16,null,"Adjudication Officer","Review the merge report that was generated for me ","Merge records that have been determined to be the same person ","Manage Customer Records","Manage Duplicate Records","Merge Records","Manage Customer Records-Manage Duplicate Records-Merge Records",{"$f":"VLOOKUP(I17,'SADLS Business Capability Model'!$E$1:$F$299,2,FALSE)","v":"Merge information from duplicate record to target record based on business rules and user action. (When merge is completed the record is removed from the system) "}]
[17,null,"System","Merge records that have been determined to be one and same person ","Review and correct the records as mandated by law ","Manage Customer Records","Manage Duplicate Records","Merge Records","Manage Customer Records-Manage Duplicate Records-Merge Records",{"$f":"VLOOKUP(I18,'SADLS Business Capability Model'!$E$1:$F$299,2,FALSE)","v":"Merge information from duplicate record to target record based on business rules and user action. (When merge is completed the record is removed from the system) "}]
[18,null,"System","Inactivate the Source Record","Remove the SADLS record from the SADLS User Interface but keep record intact on the back-end","Manage Customer Records","Manage Duplicate Records","Inactivate Duplicate Record","Manage Customer Records-Manage Duplicate Records-Inactivate Duplicate Record",{"$f":"VLOOKUP(I19,'SADLS Business Capability Model'!$E$1:$F$299,2,FALSE)","v":"Inactivate or remove the duplicate record after merge is completed. Once the record is removed it should no longer be searchable using a standard user search screen. "}]
[19,null,"Adjudication Officer","Add a Stop Issuance to the record ","Assure a DL will not be issued during the time the driving record is being corrected ","Manage Credentials","Disable Record","Block Record","Manage Credentials-Disable Record-Block Record",{"$f":"VLOOKUP(I20,'SADLS Business Capability Model'!$E$1:$F$299,2,FALSE)","v":"Allow system user to block/stop to an account when it is determined that the user should not be allowed to immediately return the account to active. "}]
{"$rows_left_out":768}
{"sheet":"Use Cases","index":1,"n_rows":210,"n_cols":1,"rows_kept":210,"cut":false,"hidden":false,"merged":[]}
["Use Case "]
["Active SB Driver - DMV K Restriction "]
["Active SB Driver - Medical Cancellation "]
["Active SB Driver - Other potential Cancellation "]
["Active SB Driver - Renewal "]
["Active SB Driver Statistical Accountability - DMV k restriction "]
["Active SB Driver Statistical Accountability Renewal "]
["Active SB Driver Statistical Accountability Review "]
["Add a Driver"]
["Address Validation"]
["Adjudicate Incompetence"]
["Adjudication System Maintenance (D707)"]
["Administer Driving Skills Test"]
["Administer Knowledge Tests"]
["Administer Traffic Signs Test"]
["Administer Vision Tests"]
["Appeal Administrative Hearing"]
["Approve Medical Waiver"]
["AR Report - Date Range"]
["AR Report - Monthly"]
{"$rows_left_out":191}
{"sheet":"SADLS Business Capability Model","index":2,"n_rows":290,"n_cols":9,"rows_kept":290,"cut":false,"hidden":true,"merged":[]}
["Level 0","Level 1","Level 2","Level 3","Compound Column","Definition","Notes","Story Count"]
["Manage Customer Interactions","Manage Customer Records","Create New Record",null,{"$f":"IF(LEN(D2)>0,TRIM(CONCATENATE(B2,\"-\",C2,\"-\",D2)),\"\")","v":""},"Setting up a new customer record and capturing all relevant details initially available (e.g.,  primary/secondary address, phone, email, etc.).  Initial record information may also include details regarding applications, licenses, and other transactional data.  ","Changed the language here from Customer Account -> Customer Record. Removed Non-SADLS info and To-Be Information",{"$f":"IF(LEN(D2)=0,\"\",COUNTIF(User_Stories!$I$1:$I$800,\"=\" & IF(LEN(E2) > 5,E2,\"zzzz\")))","v":""}," "]
[null,"Manage Customer Records","Create New Record","Capture Contact Information",{"$f":"IF(LEN(D3)>0,TRIM(CONCATENATE(B3,\"-\",C3,\"-\",D3)),\"\")","v":"Manage Customer Records-Create New Record-Capture Contact Information"},"To create a new record DMV must collect standard contact information regarding the contact such as primary/secondary address, phone, email.  ",null,{"$f":"IF(LEN(D3)=0,\"\",COUNTIF(User_Stories!$I$1:$I$800,\"=\" & IF(LEN(E3) > 5,E3,\"zzzz\")))","v":2}," "]
[null,"Manage Customer Records","Create New Record","Capture Personal Information ",{"$f":"IF(LEN(D4)>0,TRIM(CONCATENATE(B4,\"-\",C4,\"-\",D4)),\"\")","v":"Manage Customer Records-Create New Record-Capture Personal Information"},"To create a new record DMV must collect personal information regarding the contact such as height, hair color, etc. ",null,{"$f":"IF(LEN(D4)=0,\"\",COUNTIF(User_Stories!$I$1:$I$800,\"=\" & IF(LEN(E4) > 5,E4,\"zzzz\")))","v":1}]
[null,null,"Validate Customer Information",null,"","Confirming the authenticity and accuracy of customer record information, based on review of documentation provided by the customer and manual and automated checks of records provided by external sources.","Changed the language from Customer Account to Customer Record",{"$f":"IF(LEN(D5)=0,\"\",COUNTIF(User_Stories!$I$1:$I$800,\"=\" & IF(LEN(E5) > 5,E5,\"zzzz\")))","v":""}," "]
[null,"Manage Customer Records","Validate Customer Information","Confirm Accuracy of Customer Information ","Manage Customer Records-Validate Customer Information-Confirm Accuracy of Customer Information","Confirm that the information entered into the system (regardless of who it was entered by) was typed accurately and meets DMV entry standards ",null,{"$f":"IF(LEN(D6)=0,\"\",COUNTIF(User_Stories!$I$1:$I$800,\"=\" & IF(LEN(E6) > 5,E6,\"zzzz\")))","v":4}]
[null,"Manage Customer Records","Validate Customer Information","Review Documentation for Authenticity ","Manage Customer Records-Validate Customer Information-Review Documentation for Authenticity","Review Documentation to verify that Customer information into the system was entered properly and accurately. ",null,{"$f":"IF(LEN(D7)=0,\"\",COUNTIF(User_Stories!$I$1:$I$800,\"=\" & IF(LEN(E7) > 5,E7,\"zzzz\")))","v":1}]
[null,"Manage Customer Records","Validate Customer Information","Conduct External Checks ","Manage Customer Records-Validate Customer Information-Conduct External Checks","Conduct any automated checks available to ensure information is entered correctly and accurately (e.g., Address validation, SSN, Validation of Lawful Status,  and formatted properly) ",null,{"$f":"IF(LEN(D8)=0,\"\",COUNTIF(User_Stories!$I$1:$I$800,\"=\" & IF(LEN(E8) > 5,E8,\"zzzz\")))","v":4}]
[null,null,"Manage Duplicate Records",null,"","Identifying duplicate record information and merging correct record details into a single accurate customer record. ","Changed the language from Customer Account to Customer Record",{"$f":"IF(LEN(D9)=0,\"\",COUNTIF(User_Stories!$I$1:$I$800,\"=\" & IF(LEN(E9) > 5,E9,\"zzzz\")))","v":""}]
[null,"Manage Customer Records","Manage Duplicate Records","Identify Duplicate Record ","Manage Customer Records-Manage Duplicate Records-Identify Duplicate Record","Run standard reports using name, address, birthdate and other identifying information in the system to find and eliminate a duplicate record ","Changed the language from Customer Account to Customer Record",{"$f":"IF(LEN(D10)=0,\"\",COUNTIF(User_Stories!$I$1:$I$800,\"=\" & IF(LEN(E10) > 5,E10,\"zzzz\")))","v":4}]
[null,"Manage Customer Records","Manage Duplicate Records","Identify Target Record ","Manage Customer Records-Manage Duplicate Records-Identify Target Record","Run standard search or process  to find target record where information should be consolidated ",null,{"$f":"IF(LEN(D11)=0,\"\",COUNTIF(User_Stories!$I$1:$I$800,\"=\" & IF(LEN(E11) > 5,E11,\"zzzz\")))","v":1}]
[null,"Manage Customer Records","Manage Duplicate Records","Merge Records","Manage Customer Records-Manage Duplicate Records-Merge Records","Merge information from duplicate record to target record based on business rules and user action. (When merge is completed the record is removed from the system) ",null,{"$f":"IF(LEN(D12)=0,\"\",COUNTIF(User_Stories!$I$1:$I$800,\"=\" & IF(LEN(E12) > 5,E12,\"zzzz\")))","v":3}]
[null,"Manage Customer Records","Manage Duplicate Records","Transfer Record Data","Manage Customer Records-Manage Duplicate Records-Transfer Record Data","Transferring certain record information from one record to another while keeping both records intact within the system","Updated information to reflect that Transfer keeps the Record",{"$f":"IF(LEN(D13)=0,\"\",COUNTIF(User_Stories!$I$1:$I$800,\"=\" & IF(LEN(E13) > 5,E13,\"zzzz\")))","v":2}]
[null,"Manage Customer Records","Manage Duplicate Records","Inactivate Duplicate Record","Manage Customer Records-Manage Duplicate Records-Inactivate Duplicate Record","Inactivate or remove the duplicate record after merge is completed. Once the record is removed it should no longer be searchable using a standard user search screen. ","Added the definition. ",{"$f":"IF(LEN(D14)=0,\"\",COUNTIF(User_Stories!$I$1:$I$800,\"=\" & IF(LEN(E14) > 5,E14,\"zzzz\")))","v":1}]
[" ",null,"Maintain Records",null,"","Providing ongoing updates to a customer record, including changes in contact information, addition/deletion of registered vehicles, addition/removal of licensed drivers in a household, updates in liability insurance information, changes in license and/or registration renewal status, etc.","Changed from Account to Record",{"$f":"IF(LEN(D15)=0,\"\",COUNTIF(User_Stories!$I$1:$I$800,\"=\" & IF(LEN(E15) > 5,E15,\"zzzz\")))","v":""}]
[null,"Manage Customer Records","Maintain Records","View Contact, Personal, Driver, and Other Information","Manage Customer Records-Maintain Records-View Contact, Personal, Driver, and Other Information","Allow user with appropriate permissions to view standard information available on a motor vehicle record ","Account -> Record in Definition",{"$f":"IF(LEN(D16)=0,\"\",COUNTIF(User_Stories!$I$1:$I$800,\"=\" & IF(LEN(E16) > 5,E16,\"zzzz\")))","v":15}]
[null,"Manage Customer Records","Maintain Records","Update Contact, Personal, Driver, and Other Information ","Manage Customer Records-Maintain Records-Update Contact, Personal, Driver, and Other Information","Allow user with appropriate permissions to update standard  information available on a motor vehicle record ","Account -> Record in Definition",{"$f":"IF(LEN(D17)=0,\"\",COUNTIF(User_Stories!$I$1:$I$800,\"=\" & IF(LEN(E17) > 5,E17,\"zzzz\")))","v":27}]
[null,"Manage Customer Records","Maintain Records","Print Contact, Personal, Driver, and Other Information ","Manage Customer Records-Maintain Records-Print Contact, Personal, Driver, and Other Information","Allow user with appropriate permissions to print information from the motor vehicle record","Added 3/19/2020",{"$f":"IF(LEN(D18)=0,\"\",COUNTIF(User_Stories!$I$1:$I$800,\"=\" & IF(LEN(E18) > 5,E18,\"zzzz\")))","v":3}]
[null,"Manage Customer Records","Maintain Records","Generate Correspondence ","Manage Customer Records-Maintain Records-Generate Correspondence","Allow user with appropriate permissions to generate correspondence utilizing information from the motor vehicle record","Added 3/19/2020",{"$f":"IF(LEN(D19)=0,\"\",COUNTIF(User_Stories!$I$1:$I$800,\"=\" & IF(LEN(E19) > 5,E19,\"zzzz\")))","v":7}]
[null,"Manage Customer Records","Maintain Records","Associate Records with TNS","Manage Customer Records-Maintain Records-Associate Records with TNS","Allow user with appropriate permissions to associate employee driver records with a company via the Transit Notification System (TNS)",null,{"$f":"IF(LEN(D20)=0,\"\",COUNTIF(User_Stories!$I$1:$I$800,\"=\" & IF(LEN(E20) > 5,E20,\"zzzz\")))","v":23}]
{"$rows_left_out":271}
{"sheet":"SADLS Users","index":3,"n_rows":29,"n_cols":1,"rows_kept":29,"cut":false,"hidden":true,"merged":[]}
["Adjudication Officer"]
["Administrative Support Unit"]
["Call Center"]
["CDL Med CERT"]
["CDL Unit"]
["Central Issuance Quality Assurance"]
["Central Issuance Verification"]
["Crash Unit"]
["Data Capture Unit"]
["DMV - Raleigh"]
["DMV Medical Unit"]
["Driver Education Program Specialist "]
["Examiner - Any"]
["Fiscal"]
["Fraud Unit"]
["Hearing Officer"]
["Help Desk"]
["Ignition Interlock Unit"]
["License and Theft Bureau Inspector "]
["Military Internet Unit"]
{"$rows_left_out":10}
{"sheet":"DMV Staff Pos Codes","index":4,"n_rows":68,"n_cols":2,"rows_kept":68,"cut":false,"hidden":true,"merged":[[0,0,1,0],[0,1,1,1]]}
["Staff Position Code","Position Description"]
[]
["AD","ADMINISTRATION"]
["AH","ACCIDENT HEARING OFFICER"]
["AO","AOC CHILD SUPPORT"]
["AS","ASST. DISTRICT SUPERVISOR"]
["AU","AUDITOR (collect DMV money every day)"]
["CA","CENTRAL ISSUANCE ADMINISTRATOR (higher access than CI)"]
["CD","CONTRACT DOCTORS"]
["CH","CHIEF HEARING OFFICER"]
["CI","CENTRAL ISSUANCE"]
["CM","CUSTOMER MERGE PERSONNEL (GENERAL STAFF)"]
["CR","APPROVER OF CONDITIONAL RESTORATIONS"]
["CS","CUSTOMER SERVICE"]
["DC","CDL MEDICAL CERTIFICATION CLERK"]
["DE","DATA ENTRY"]
["DI","DEPT. OF REVENUE"]
["DM","CDL MEDICAL CERTIFICATION MANAGER"]
["DO","DROP OUT PREVENTION"]
["DQ","GENERIC PASSTHRU FOR D116, NOT SET UP ON STAFF TABLE"]
{"$rows_left_out":48}